{"text_format":"1","workbook":"xlsx","n_sheets":7,"sheets":["Sheet1","Sheet2","報告書","設定","データ","説明とメニュー","褒賞申請都連用"],"not_rendered":{"charts":0,"images":0,"macros":1,"external_links":0,"defined_names":1,"comments":1,"pivot_tables":0},"unopened":[],"bounds":{"document_bytes":16777216,"sheet_cells":100000,"rows_first":2000,"rows_last":500,"rows_between":2000,"halvings":0,"cell_chars":16384,"cell_head_chars":4096},"cells_cut":0,"cells_raw":0,"read":"whole","date_system":"1900"}

{"sheet":"Sheet1","index":0,"n_rows":297,"n_cols":37,"rows_kept":297,"cut":false,"hidden":true,"merged":[[2,24,2,27],[2,8,2,11],[2,12,2,15],[2,16,2,19],[2,20,2,23],[2,2,3,2],[2,7,3,7],[2,3,3,3],[2,4,3,4],[2,5,3,5],[2,6,3,6]]}
[]
[]
[null,null,null,null,null,"ＨＧ","ＨＳ","所属","１回戦",null,null,null,"2回戦",null,null,null,"3回戦",null,null,null,"準決勝前半",null,null,null,"準決勝後半"]
[null,null,null,null,null,null,null,null,"1G","2G","3G","計","4G","5G","6G","計","7G","8G","9G","計","1G","2G","3G","計","4G","5G","6G","計"]
["24","24-A-00140","高橋俊彦",{"$f":"SUM(I5:K5,M5:O5,Q5:S5,U5:W5,Y5:AA5,AC5:AK5)","v":5615},{"$f":"COUNTA(I5:K5,M5:O5,Q5:S5,U5:W5,Y5:AA5,AC5:AK5)","v":23},{"$f":"MAX(I5:K5,M5:O5,Q5:S5,U5:W5,Y5:AA5,AC5:AK5)","v":289},803,"岐阜",279,247,277,803,221,228,278,727,237,257,226,720,289,215,267,771,233,207,236,676,237,279,247,224,237,267,235,192]
["21","21-A-00250","池田康弘",5150,22,289,792,"静岡",205,259,237,701,228,193,214,635,268,235,257,760,257,246,289,792,258,216,248,722,181,227,224,230,258,205,215]
["22","22-J-20037","吉田大祐",5671,24,289,758,"愛知",245,243,223,711,215,259,248,722,212,247,235,694,289,184,247,720,258,223,277,758,227,247,217,224,278,235,217,214,207]
["22","22-A-00215","田村浩也",5190,22,279,739,"愛知",227,246,237,710,245,237,203,685,218,236,268,722,246,179,279,704,237,225,277,739,258,268,224,247,221,174,238]
["18","18-A-00329","渡辺佳嗣",5059,22,280,769,"富山",278,258,233,769,231,280,203,714,247,228,212,687,246,209,245,700,194,227,234,655,223,235,202,203,197,237,237]
["14","14-A-00199","田中政美",5133,22,278,773,"神奈川",266,217,191,674,192,258,232,682,237,215,259,711,223,183,266,672,278,257,238,773,201,227,237,246,237,236,237]
["14","14-A-00485","鶴見亮剛",5057,22,280,740,"神奈川",214,269,247,730,202,236,268,706,215,247,237,699,267,280,193,740,184,222,228,634,259,238,218,159,207,238,229]
["22","22-A-00273","野々山寿光",4976,22,269,770,"愛知",203,236,246,685,200,199,227,626,257,243,215,715,239,238,224,701,269,243,258,770,182,215,208,194,205,247,228]
["11","11-A-00154","原田　優",5032,22,265,762,"埼玉",233,254,259,746,174,204,228,606,201,258,237,696,258,258,246,762,193,265,222,680,217,207,248,210,214,233,213]
["22","22-A-00146","田中　亨",4818,22,300,790,"愛知",224,245,256,725,224,209,216,649,234,257,183,674,278,300,212,790,205,204,226,635,205,162,204,162,235,172,205]
["10","10-J-20029","福田尊仁",5059,22,279,722,"群馬",257,235,213,705,226,238,202,666,270,216,197,683,202,225,238,665,279,206,237,722,238,215,247,214,248,248,208]
["21","21-A-00113","小柳靖士",5294,23,258,720,"静岡",226,224,225,675,226,200,258,684,198,247,226,671,238,247,235,720,204,237,237,678,246,255,194,213,254,246,258,200]
["53","53-U-10021","今野裕貴",3402,15,280,707,"学連",227,224,228,679,257,193,248,698,242,233,191,666,203,235,214,652,280,226,201,707]
["21","21-C-00023","石島哲也",3392,15,258,772,"静岡",187,257,216,660,258,256,258,772,180,242,235,657,237,205,248,690,220,192,201,613]
["40","40-A-01068","和田翔吾",3390,15,280,704,"福岡",202,226,275,703,267,214,206,687,247,181,276,704,202,217,213,632,160,280,224,664]
["13","13-A-00891","山下知且",3390,15,266,730,"東京",259,244,227,730,256,238,196,690,266,182,207,655,247,219,215,681,201,206,227,634]
{"$rows_left_out":278}
{"sheet":"Sheet2","index":1,"n_rows":293,"n_cols":2,"rows_kept":293,"cut":false,"hidden":true,"merged":[]}
["阿曽敏男","07-A-00194"]
["阿部暁美","03-A-00128"]
["安岡　武","14-A-00510"]
["伊東裕章","13-H-04015"]
["伊藤　丈","07-A-00007"]
["伊藤　博","40-A-00278"]
["伊藤嘉彦","23-A-00010"]
["伊藤美絵","22-A-00495"]
["伊藤友里",""]
["井上三菜子","26-J-20019"]
["井爪敬二","26-A-00168"]
["稲垣　翔","14-H-03015"]
["永広加奈子","26-J-30019"]
["越後拓真","06-H-01072"]
["越後裕哉","13-C-00405"]
["園部恵理","10-A-00098"]
["遠地美和","22-C-00051"]
["遠藤金龍","21-C-00053"]
["遠藤充朗","07-J-20005"]
["奥　由佳利","14-H-03022"]
{"$rows_left_out":274}
{"sheet":"報告書","index":2,"n_rows":56,"n_cols":16,"rows_kept":56,"cut":false,"hidden":false,"merged":[[11,2,11,4],[13,4,14,8],[15,4,16,6],[15,11,16,14],[15,8,15,10],[16,8,16,10],[54,11,54,13],[54,14,54,15],[13,15,14,15],[48,9,49,11],[48,12,49,12],[48,13,49,15],[18,8,18,9],[18,11,18,13],[22,8,22,9],[22,11,22,13],[23,8,23,9],[23,11,23,13],[17,11,17,13],[19,11,19,13],[20,11,20,13],[21,11,21,13],[24,11,24,13],[25,11,25,13],[26,8,26,9],[26,11,26,13],[48,7,49,8],[27,11,27,13],[28,5,28,7],[28,8,28,9],[28,11,28,13],[29,5,29,7],[48,6,49,6],[48,5,49,5],[29,11,29,13],[30,8,30,9],[30,11,30,13],[31,5,31,7],[31,8,31,9],[31,11,31,13],[17,2,17,3],[17,8,17,9],[17,5,17,7],[33,2,33,3],[18,2,18,3],[18,5,18,7],[48,2,49,2],[19,5,19,7],[21,5,21,7],[23,5,23,7],[22,5,22,7],[19,8,19,9],[20,5,20,7],[20,8,20,9],[21,8,21,9],[24,5,24,7],[24,8,24,9],[25,5,25,7],[25,8,25,9],[26,5,26,7],[27,5,27,7],[27,8,27,9],[29,8,29,9],[30,5,30,7],[42,1,43,1],[27,1,28,1],[32,1,33,1],[37,1,38,1],[47,1,48,1],[27,2,27,3],[29,2,29,3],[31,2,31,3],[19,2,19,3],[21,2,21,3],[23,2,23,3],[22,1,23,1],[20,2,20,3],[22,2,22,3],[24,2,24,3],[25,2,25,3],[26,2,26,3],[30,2,30,3],[36,2,36,3],[39,2,39,3],[42,2,42,3],[45,2,45,3],[48,3,49,4],[28,2,28,3],[32,2,32,3],[32,5,32,7],[32,8,32,9],[32,11,32,13],[33,5,33,7],[33,8,33,9],[33,11,33,13],[34,2,34,3],[34,5,34,7],[34,8,34,9],[34,11,34,13],[35,2,35,3],[35,5,35,7],[35,8,35,9],[35,11,35,13],[36,5,36,7],[36,8,36,9],[36,11,36,13],[37,2,37,3],[37,5,37,7],[37,8,37,9],[37,11,37,13],[38,2,38,3],[38,5,38,7],[38,8,38,9],[38,11,38,13],[39,5,39,7],[39,8,39,9],[39,11,39,13],[40,2,40,3],[40,5,40,7],[40,8,40,9],[40,11,40,13],[41,2,41,3],[41,5,41,7],[41,8,41,9],[41,11,41,13],[42,5,42,7],[42,8,42,9],[42,11,42,13],[43,2,43,3],[43,5,43,7],[43,8,43,9],[43,11,43,13],[47,2,47,3],[47,5,47,7],[47,8,47,9],[47,11,47,13],[44,2,44,3],[44,5,44,7],[44,8,44,9],[44,11,44,13],[45,5,45,7],[45,8,45,9],[45,11,45,13],[46,2,46,3],[46,5,46,7],[46,8,46,9],[46,11,46,13]]}
[]
[]
[]
[]
[null,null,null,null,null,"J . B 個 人 競 技 記 録 報 告 書"]
[]
[]
[]
[]
[null,null,"下記個人競技記録を報告致します。"]
[]
[null,null,"2024-06-24",null,null,null,null,"113-121"]
[]
[null,null,null,null,"令和6年度 東京都ジュニアボウリング選手権大会",null,null,null,null,null,null,null,null,null,3,3]
[]
[null,null,null,null,"トミコシ高島平ボウル ",null,null,null,"2024-06-23",null,null,"2024-06-24"]
[null,null,null,null,null,null,null,null,"2024-06-23"]
[null,null,"連盟コード",null,"J.B 会員No.","氏　　　　　名",null,null,"ト　ー　タ　ル",null,"ゲーム","Ｈ／Ｇ",null,null,"Ｈ／Ｓ"]
[]
[]
{"$rows_left_out":37}
{"sheet":"設定","index":3,"n_rows":45,"n_cols":12,"rows_kept":45,"cut":false,"hidden":false,"merged":[]}
[null,null,null,null,null,null,null,null,null,"斉","齋",{"$f":"COUNTA(J1:J200)","v":8}]
[null,null,null,null,null,null,null,null,null,"斉","齊"]
[null,null,null,null,null,null,null,null,null,"恵","惠"]
[null,null,null,null,null,null,null,null,null,"沢","澤"]
[null,null,null,null,null,null,null,null,null,"斉","斎"]
[null,null,null,null,null,null,null,null,null,"真","眞"]
[null,null,null,null,null,null,null,null,null,"高","髙"]
["以下は自動計算ですので値は変更しないでください",null,null,null,null,null,null,null,null,"濱","浜"]
["参加人数",{"$f":"COUNTA(データ!$C$2:$C$4493)","v":0},null,null,null,null,"第１種"]
["全ゲーム数",{"$f":"SUM(データ!$E$2:$E$4493)","v":0},null,null,null,null,"第２種"]
["報告書ページ数",{"$f":"ROUNDUP(B9/30,0)","v":0},null,null,null,null,"第３種"]
["現在のファイル名",{"$f":"MID(CELL(\"filename\"),SEARCH(\"[\",CELL(\"filename\"))+1, SEARCH(\"]\",CELL(\"filename\"))-SEARCH(\"[\",CELL(\"filename\"))-1)","v":"【2024年度】JBC個人競技記録報告書作成用R5_2024.xlsm"}]
[]
["基準日","2024-04-01",null,null,null,null,"シニア男子"]
[null,null,null,null,null,null,"シニア女子"]
["氏名",null,{"$f":"C18&C17","v":"シニア"},null,null,null,"ジュニア男子"]
[null,{"$f":"IFERROR(VLOOKUP(B16,#REF!,2,FALSE),\"\")","v":""},{"$f":"IF(B17=1,\"男子\",IF(B17=2,\"女子\",\"\"))","v":""},null,null,null,"ジュニア女子"]
[null,{"$f":"IFERROR(VLOOKUP(B16,#REF!,9,FALSE),\"\")","v":""},{"$f":"IF(B18<18,\"ジュニア\",IF(B18>=50,\"シニア\",\"一般\"))","v":"シニア"},null,null,null,"一般男子"]
[null,{"$f":"IFERROR(VLOOKUP(B16,#REF!,5,FALSE),\"\")","v":""},null,null,null,null,"一般女子"]
[]
{"$rows_left_out":26}
{"sheet":"データ","index":4,"n_rows":400,"n_cols":58,"rows_kept":400,"cut":false,"hidden":false,"merged":[]}
["連盟コード","JBC番号","氏名","トータル","ゲーム数","HG","HS","入力は2行目から。",null,null,null,null,null,"１Ｇ","２Ｇ","３Ｇ","１Ｓ","４Ｇ","５Ｇ","６Ｇ","２Ｓ","７Ｇ","８Ｇ","９Ｇ","３Ｓ","１０Ｇ","１１G","１２Ｇ","４Ｓ","１３Ｇ","１４Ｇ","１５Ｇ","５Ｓ","１６Ｇ","１７Ｇ","１８Ｇ","６Ｓ","１９Ｇ","２０Ｇ","２１Ｇ","７Ｓ","２２Ｇ","２３Ｇ","２４Ｇ","８Ｓ","２５Ｇ","２６Ｇ","２７Ｇ","９Ｓ","２８Ｇ","２９Ｇ","３０Ｇ","１０Ｓ",null,"トータル","ゲーム数","HG","HS"]
[null,null,null,null,null,null,null,null,null,null,null,null,null,null,null,null,null,null,null,null,null,null,null,null,null,null,null,null,null,null,null,null,null,null,null,null,null,null,null,null,null,null,null,null,null,null,null,null,null,null,null,null,null,null,{"$f":"SUM(N2:P2,R2:T2,V2:X2,Z2:AB2,AD2:AF2,AH2:AJ2,AL2:AN2,AP2:AR2,AT2:AV2,AX2:AZ2)","v":0},{"$f":"COUNT(N2:P2,R2:T2,V2:X2,Z2:AB2,AD2:AF2,AH2:AJ2,AL2:AN2,AP2:AR2,AT2:AV2,AX2:AZ2)","v":0},{"$f":"MAX(N2:P2,R2:T2,V2:X2,Z2:AB2,AD2:AF2,AH2:AJ2,AL2:AN2,AP2:AR2,AT2:AV2,AX2:AZ2)","v":0},{"$f":"MAX(Q2,U2,Y2,AC2,AG2,AK2,AO2,AS2,AW2,BA2)","v":0}]
[null,null,null,null,null,null,null,null,null,null,null,null,null,null,null,null,null,null,null,null,null,null,null,null,null,null,null,null,null,null,null,null,null,null,null,null,null,null,null,null,null,null,null,null,null,null,null,null,null,null,null,null,null,null,0,0,0,0]
[null,null,null,null,null,null,null,null,null,null,null,null,null,null,null,null,null,null,null,null,null,null,null,null,null,null,null,null,null,null,null,null,null,null,null,null,null,null,null,null,null,null,null,null,null,null,null,null,null,null,null,null,null,null,0,0,0,0]
[null,null,null,null,null,null,null,null,null,null,null,null,null,null,null,null,null,null,null,null,null,null,null,null,null,null,null,null,null,null,null,null,null,null,null,null,null,null,null,null,null,null,null,null,null,null,null,null,null,null,null,null,null,null,0,0,0,0]
[null,null,null,null,null,null,null,null,null,null,null,null,null,null,null,null,null,null,null,null,null,null,null,null,null,null,null,null,null,null,null,null,null,null,null,null,null,null,null,null,null,null,null,null,null,null,null,null,null,null,null,null,null,null,0,0,0,0]
[null,null,null,null,null,null,null,null,null,null,null,null,null,null,null,null,null,null,null,null,null,null,null,null,null,null,null,null,null,null,null,null,null,null,null,null,null,null,null,null,null,null,null,null,null,null,null,null,null,null,null,null,null,null,0,0,0,0]
[null,null,null,null,null,null,null,null,null,null,null,null,null,null,null,null,null,null,null,null,null,null,null,null,null,null,null,null,null,null,null,null,null,null,null,null,null,null,null,null,null,null,null,null,null,null,null,null,null,null,null,null,null,null,0,0,0,0]
[null,null,null,null,null,null,null,null,null,null,null,null,null,null,null,null,null,null,null,null,null,null,null,null,null,null,null,null,null,null,null,null,null,null,null,null,null,null,null,null,null,null,null,null,null,null,null,null,null,null,null,null,null,null,0,0,0,0]
[null,null,null,null,null,null,null,null,null,null,null,null,null,null,null,null,null,null,null,null,null,null,null,null,null,null,null,null,null,null,null,null,null,null,null,null,null,null,null,null,null,null,null,null,null,null,null,null,null,null,null,null,null,null,0,0,0,0]
[null,null,null,null,null,null,null,null,null,null,null,null,null,null,null,null,null,null,null,null,null,null,null,null,null,null,null,null,null,null,null,null,null,null,null,null,null,null,null,null,null,null,null,null,null,null,null,null,null,null,null,null,null,null,0,0,0,0]
[null,null,null,null,null,null,null,null,null,null,null,null,null,null,null,null,null,null,null,null,null,null,null,null,null,null,null,null,null,null,null,null,null,null,null,null,null,null,null,null,null,null,null,null,null,null,null,null,null,null,null,null,null,null,0,0,0,0]
[null,null,null,null,null,null,null,null,null,null,null,null,null,null,null,null,null,null,null,null,null,null,null,null,null,null,null,null,null,null,null,null,null,null,null,null,null,null,null,null,null,null,null,null,null,null,null,null,null,null,null,null,null,null,0,0,0,0]
[null,null,null,null,null,null,null,null,null,null,null,null,null,null,null,null,null,null,null,null,null,null,null,null,null,null,null,null,null,null,null,null,null,null,null,null,null,null,null,null,null,null,null,null,null,null,null,null,null,null,null,null,null,null,0,0,0,0]
[null,null,null,null,null,null,null,null,null,null,null,null,null,null,null,null,null,null,null,null,null,null,null,null,null,null,null,null,null,null,null,null,null,null,null,null,null,null,null,null,null,null,null,null,null,null,null,null,null,null,null,null,null,null,0,0,0,0]
[null,null,null,null,null,null,null,null,null,null,null,null,null,null,null,null,null,null,null,null,null,null,null,null,null,null,null,null,null,null,null,null,null,null,null,null,null,null,null,null,null,null,null,null,null,null,null,null,null,null,null,null,null,null,0,0,0,0]
[null,null,null,null,null,null,null,null,null,null,null,null,null,null,null,null,null,null,null,null,null,null,null,null,null,null,null,null,null,null,null,null,null,null,null,null,null,null,null,null,null,null,null,null,null,null,null,null,null,null,null,null,null,null,0,0,0,0]
[null,null,null,null,null,null,null,null,null,null,null,null,null,null,null,null,null,null,null,null,null,null,null,null,null,null,null,null,null,null,null,null,null,null,null,null,null,null,null,null,null,null,null,null,null,null,null,null,null,null,null,null,null,null,0,0,0,0]
[null,null,null,null,null,null,null,null,null,null,null,null,null,null,null,null,null,null,null,null,null,null,null,null,null,null,null,null,null,null,null,null,null,null,null,null,null,null,null,null,null,null,null,null,null,null,null,null,null,null,null,null,null,null,0,0,0,0]
[null,null,null,null,null,null,null,null,null,null,null,null,null,null,null,null,null,null,null,null,null,null,null,null,null,null,null,null,null,null,null,null,null,null,null,null,null,null,null,null,null,null,null,null,null,null,null,null,null,null,null,null,null,null,0,0,0,0]
{"$rows_left_out":381}
{"sheet":"説明とメニュー","index":5,"n_rows":60,"n_cols":28,"rows_kept":60,"cut":false,"hidden":false,"merged":[[47,5,47,7],[47,8,47,9],[47,11,47,13],[46,2,46,3],[46,5,46,7],[46,8,46,9],[46,11,46,13],[45,2,45,3],[45,5,45,7],[45,8,45,9],[45,11,45,13],[44,5,44,7],[44,8,44,9],[44,11,44,13],[43,2,43,3],[43,5,43,7],[43,8,43,9],[43,11,43,13],[42,2,42,3],[42,5,42,7],[42,8,42,9],[42,11,42,13],[37,5,37,7],[37,8,37,9],[37,11,37,13],[36,2,36,3],[36,5,36,7],[41,2,41,3],[41,5,41,7],[41,8,41,9],[41,11,41,13],[40,2,40,3],[40,5,40,7],[40,8,40,9],[40,11,40,13],[36,8,36,9],[36,11,36,13],[39,2,39,3],[39,5,39,7],[39,8,39,9],[39,11,39,13],[38,2,38,3],[38,5,38,7],[38,8,38,9],[38,11,38,13],[32,5,32,7],[32,8,32,9],[32,11,32,13],[35,5,35,7],[35,8,35,9],[35,11,35,13],[33,5,33,7],[33,8,33,9],[34,2,34,3],[33,11,33,13],[34,5,34,7],[34,8,34,9],[34,11,34,13],[29,5,29,7],[29,8,29,9],[29,11,29,13],[30,2,30,3],[30,5,30,7],[30,8,30,9],[30,11,30,13],[31,5,31,7],[31,8,31,9],[31,11,31,13],[22,1,23,1],[23,5,23,7],[27,5,27,7],[27,8,27,9],[27,11,27,13],[28,2,28,3],[28,5,28,7],[28,8,28,9],[28,11,28,13],[26,2,26,3],[26,5,26,7],[26,8,26,9],[26,11,26,13],[21,5,21,7],[22,5,22,7],[25,2,25,3],[25,5,25,7],[25,8,25,9],[25,11,25,13],[24,2,24,3],[24,5,24,7],[24,8,24,9],[24,11,24,13],[42,1,43,1],[27,1,28,1],[32,1,33,1],[37,1,38,1],[47,1,48,1],[27,2,27,3],[29,2,29,3],[31,2,31,3],[33,2,33,3],[35,2,35,3],[32,2,32,3],[37,2,37,3],[44,2,44,3],[47,2,47,3],[17,2,17,3],[17,8,17,9],[17,5,17,7],[17,11,17,13],[48,3,49,4],[48,7,49,8],[48,6,49,6],[48,5,49,5],[48,2,49,2],[23,2,23,3],[18,2,18,3],[18,5,18,7],[19,2,19,3],[19,5,19,7],[19,8,19,9],[19,11,19,13],[20,2,20,3],[20,5,20,7],[20,8,20,9],[20,11,20,13],[21,8,21,9],[21,11,21,13],[22,2,22,3],[21,2,21,3],[13,15,14,15],[48,9,49,11],[48,12,49,12],[48,13,49,15],[18,8,18,9],[18,11,18,13],[22,8,22,9],[22,11,22,13],[23,8,23,9],[23,11,23,13]]}
[]
[]
[null,null,null,null,null,null,null,null,null,null,null,null,null,null,null,null,null,"個人競技記録報告書を自動作成します。",null,null,null,null,null,"2024/6/24更新版"]
[]
[null,null,null,null,null,"J.  B  個人競技記録報告書",null,null,null,null,null,null,null,null,null,null,null,"このファイルの使い方",null,null,null,null,null,null,"報告書内容"]
[]
[null,null,null,null,null,null,null,null,null,null,null,null,null,null,null,null,null,"（１）「報告書」シートの必要事項を右の欄に入力します",null,null,null,null,null,null,"報告日","2024-06-24"]
[null,null,null,null,null,null,null,null,null,null,null,null,null,null,null,null,null,"　　　入力後「↓の内容を報告書に反映」をクリックしてください。",null,null,null,null,null,null,"会場","トミコシ高島平ボウル ",{"$f":"IFERROR(VLOOKUP(Z8,設定!A23:B70,2,FALSE),\"\")","v":"113-121"}," "]
[null,null,null,null,null,null,null,null,null,null,null,null,null,null,null,null,null,"（２）「データ」シートに会員番号や氏名などの情報を入力してください。",null,null,null,null,null,null,"リーグ・競技会名","令和6年度 東京都ジュニアボウリング選手権大会"]
[null,null,"下記個人競技記録を報告致します。",null,null,null,null,null,null,null,null,null,null,null,null,null,null,"（３）入力が終わったら、下の[印刷]または[ファイル保存]を押してください",null,null,null,null,null,null,"開催年月日（自）","2024-06-23"]
[null,null,null,null,null,null,null,null,null,null,null,null,null,null,null,null,null,null,null,null,null,null,null,null,"開催年月日（至）","2024-06-23"]
[null,null,null,null,null,null,null,null,null,null,null,null,null,null,null,null,null,null,"メニュー",null,null,null,null,null,"記入日","2024-06-24"]
[]
[null,null,null,null,null,null,null,null,null,null,null,null,null,null,null,"１　",null,null,null,null,null,null,null,null,"立会審判員","第１種"]
[null,null,null,null,null,null,null,null,null,null,null,null,null,null,null,null,null,null,null,null,null,null,null,null,"〃　氏名"]
[null,null,null,null,null,null,null,null,null,null,null,null,null,null,null,null,null,null,null,null,null,{"$f":"設定!B11","v":0}]
[]
[null,null,"連盟コード",null,"J.B.C 会員No.","氏　　　　　名",null,null,"ト　ー　タ　ル",null,"ゲーム","Ｈ／Ｇ",null,null,"Ｈ／Ｓ",null,null,null,null,null,null,null,null,null,"種目","個人戦"]
[null,null,null,null,null,null,null,null,null,null,null,null,null,null,null,null,null,null,null,null,"報告書シートを1つのExcelファイル"]
[null,null,null,null,null,null,null,null,null,null,null,null,null,null,null,null,null,null,null,null,"にまとめて保存します。"]
{"$rows_left_out":41}
{"sheet":"褒賞申請都連用","index":6,"n_rows":31,"n_cols":39,"rows_kept":31,"cut":false,"hidden":false,"merged":[[7,25,7,38],[7,5,7,18],[17,8,17,9],[17,10,17,18],[17,19,17,27],[16,0,17,7],[16,8,16,9],[16,10,16,18],[16,19,16,27],[14,0,14,7],[14,8,14,9],[14,10,14,18],[14,19,14,27],[13,0,13,7],[13,8,13,9],[13,10,13,18],[12,28,17,29],[15,0,15,7],[15,8,15,9],[15,10,15,18],[15,19,15,27],[13,19,13,27],[12,0,12,7],[12,8,12,9],[12,10,12,18],[12,19,12,27],[11,0,11,9],[11,10,11,18],[11,19,11,27],[8,28,8,38],[10,0,10,9],[10,10,10,27],[10,28,11,38],[4,5,4,21],[6,7,6,18],[3,5,3,21],[3,27,3,38],[1,0,1,38],[2,5,2,21],[2,28,2,38]]}
[]
["褒　賞　用　紙"]
["大会名：",null,null,null,null,{"$f":"説明とメニュー!Z9","v":"令和6年度 東京都ジュニアボウリング選手権大会"},null,null,null,null,null,null,null,null,null,null,null,null,null,null,null,null,null,"会　場：",null,null,null,null,{"$f":"説明とメニュー!Z8","v":"トミコシ高島平ボウル "}]
["氏　名：",null,null,null,null,null,null,null,null,null,null,null,null,null,null,null,null,null,null,null,null,null,null,"JB No.："]
["所　属：",null,null,null,null,null,null,null,null,null,null,null,null,null,null,null,null,null,null,null,null,null,null,null,null,null,null,null,null,"シ ニ ア 50歳以上"]
[null,null,null,null,null,null,null,null,null,null,null,null,null,null,null,null,null,null,null,null,null,null,null,null,null,null,null,null,null,"ジュニア 18歳以下"]
["投球レーン："]
["記録日：",null,null,null,null,{"$f":"説明とメニュー!Z10","v":"2024-06-23"},null,null,null,null,null,null,null,null,null,null,null,null,null,null,"種　目：",null,null,null,null,{"$f":"説明とメニュー!Z18","v":"個人戦"}]
["褒賞の種類：Ｈ/Ｇ ・ Ｈ/Ｓ ・ 特別技能",null,null,null,null,null,null,null,null,null,null,null,null,null,null,null,null,null,null,null,null,null,null,"スコア：",null,null,null,null,277]
[]
["褒　　賞",null,null,null,null,null,null,null,null,null,"優 秀 技 能 賞",null,null,null,null,null,null,null,null,null,null,null,null,null,null,null,null,null,"特 別 技 能 賞"]
["資　　格",null,null,null,null,null,null,null,null,null,"ゲーム",null,null,null,null,null,null,null,null,"シリーズ"]
["ジュニア",null,null,null,null,null,null,null,"男",null,"２６０以上",null,null,null,null,null,null,null,null,"７００以上",null,null,null,null,null,null,null,null,"共\n\n通",null,"オールスペア賞"]
["(18歳未満)",null,null,null,null,null,null,null,"女",null,"２５０以上",null,null,null,null,null,null,null,null,"６５０以上",null,null,null,null,null,null,null,null,null,null,"トリプルキット賞"]
["シ ニ ア",null,null,null,null,null,null,null,"男",null,"２６０以上",null,null,null,null,null,null,null,null,"７００以上",null,null,null,null,null,null,null,null,null,null,"ダッチマン賞"]
["(50歳以上)",null,null,null,null,null,null,null,"女",null,"２５０以上",null,null,null,null,null,null,null,null,"６５０以上",null,null,null,null,null,null,null,null,null,null,"スプリット賞"]
["一　　般",null,null,null,null,null,null,null,"男",null,"２７０以上",null,null,null,null,null,null,null,null,"７５０以上",null,null,null,null,null,null,null,null,null,null,"（７ - １０）"]
[null,null,null,null,null,null,null,null,"女",null,"２６０以上",null,null,null,null,null,null,null,null,"７００以上",null,null,null,null,null,null,null,null,null,null,"（4,7 - 6,10）"]
[]
[null,"立会審判員",null,null,null,null,null,null,"第",null,null,null,"種",null,null,null,null,null,null,null,null,null,null,null,null,null,null,null,null,"印"]
{"$rows_left_out":11}